Target
Polyunsaturated fatty acid 5-lipoxygenase
Ligand
BDBM50320706
Substrate
Meas. Tech.
ChEMBL_638980 (CHEMBL1168963)
IC50
92900±n/a nM
Citation
 Bridoux, AMillet, RPommery, JPommery, NHenichart, JP Synthesis and biological activity of N-aroyl-tetrahydro-gamma-carbolines. Bioorg Med Chem 18:3910-24 (2010)  
Target
Name:
Polyunsaturated fatty acid 5-lipoxygenase
Synonyms:
5-LO 5-Lipoxygenase (5-LO) 5-Lipoygenase ALOX5 LOG5 | LOX5_HUMAN
Type:
Enzyme
Mol. Mass.:
77972.74
Organism:
Homo sapiens (Human)
Description:
Recombinant protein was purified from E. coli lysate. After ammonium sulfate precipitation and subsequent steps, the supernatant (S100) was used for 5-LO activity assay.
Residue:
674
  
Inhibitor
Name:
BDBM50320706
Synonyms:
5-Benzoyl-2-{3-[3-fluoro-5-(4-methoxytetrahydro-4H-4-pyranyl)phenoxy]propyl}-2,3,4,5-tetrahydro-1H-pyrido[4,3-b]indole hydrochloride | CHEMBL1164949
Type:
Small organic molecule
Emp. Form.:
C33H35FN2O4
Mol. Mass.:
542.6404
SMILES:
COC1(CCOCC1)c1cc(F)cc(OCCCN2CCc3c(C2)c2ccccc2n3C(=O)c2ccccc2)c1
: