Target
Prostaglandin G/H synthase 1
Ligand
BDBM50320706
Substrate
Meas. Tech.
ChEMBL_638984 (CHEMBL1168967)
IC50
18200±n/a nM
Citation
 Bridoux, AMillet, RPommery, JPommery, NHenichart, JP Synthesis and biological activity of N-aroyl-tetrahydro-gamma-carbolines. Bioorg Med Chem 18:3910-24 (2010)  
Target
Name:
Prostaglandin G/H synthase 1
Synonyms:
COX-1 Cyclooxygenase Cyclooxygenase-1 (COX-1) PTGS1 | Prostaglandin G/H synthase (cyclooxygenase)
Type:
Enzyme
Mol. Mass.:
68692.62
Organism:
Homo sapiens (Human)
Description:
P23219
Residue:
599
  
Inhibitor
Name:
BDBM50320706
Synonyms:
5-Benzoyl-2-{3-[3-fluoro-5-(4-methoxytetrahydro-4H-4-pyranyl)phenoxy]propyl}-2,3,4,5-tetrahydro-1H-pyrido[4,3-b]indole hydrochloride | CHEMBL1164949
Type:
Small organic molecule
Emp. Form.:
C33H35FN2O4
Mol. Mass.:
542.6404
SMILES:
COC1(CCOCC1)c1cc(F)cc(OCCCN2CCc3c(C2)c2ccccc2n3C(=O)c2ccccc2)c1
: