Target
Prostaglandin G/H synthase 1
Ligand
BDBM50320708
Substrate
Meas. Tech.
ChEMBL_638984 (CHEMBL1168967)
IC50
7800±n/a nM
Citation
 Bridoux, AMillet, RPommery, JPommery, NHenichart, JP Synthesis and biological activity of N-aroyl-tetrahydro-gamma-carbolines. Bioorg Med Chem 18:3910-24 (2010)  
Target
Name:
Prostaglandin G/H synthase 1
Synonyms:
COX-1 Cyclooxygenase Cyclooxygenase-1 (COX-1) PTGS1 | Prostaglandin G/H synthase (cyclooxygenase)
Type:
Enzyme
Mol. Mass.:
68692.62
Organism:
Homo sapiens (Human)
Description:
P23219
Residue:
599
  
Inhibitor
Name:
BDBM50320708
Synonyms:
5-(3-Fluorobenzoyl)-2-{3-[3-fluoro-5-(4-methoxytetrahydro-4H-4-pyranyl)phenoxy]propyl}-8-methoxy-2,3,4,5-tetrahydro-1H-pyrido[4,3-b]indole hydrochloride | CHEMBL1164950
Type:
Small organic molecule
Emp. Form.:
C34H36F2N2O5
Mol. Mass.:
590.6568
SMILES:
COc1ccc2n(C(=O)c3cccc(F)c3)c3CCN(CCCOc4cc(F)cc(c4)C4(CCOCC4)OC)Cc3c2c1
: