Target
Polyunsaturated fatty acid 5-lipoxygenase
Ligand
BDBM50320711
Substrate
Meas. Tech.
ChEMBL_638981 (CHEMBL1168964)
IC50
55000±n/a nM
Citation
 Bridoux, AMillet, RPommery, JPommery, NHenichart, JP Synthesis and biological activity of N-aroyl-tetrahydro-gamma-carbolines. Bioorg Med Chem 18:3910-24 (2010)  
Target
Name:
Polyunsaturated fatty acid 5-lipoxygenase
Synonyms:
5-LO 5-Lipoxygenase (5-LO) 5-Lipoygenase ALOX5 LOG5 | LOX5_HUMAN
Type:
Enzyme
Mol. Mass.:
77972.74
Organism:
Homo sapiens (Human)
Description:
Recombinant protein was purified from E. coli lysate. After ammonium sulfate precipitation and subsequent steps, the supernatant (S100) was used for 5-LO activity assay.
Residue:
674
  
Inhibitor
Name:
BDBM50320711
Synonyms:
2-{3-[3-Fluoro-5-(4-methoxytetrahydro-4H-4-pyranyl)phenoxy]propyl}-8-methoxy-5-(2,4,6-trichlorobenzoyl)-2,3,4,5-tetrahydro-1H-pyrido[4,3-b]indole hydrochloride | CHEMBL1163221
Type:
Small organic molecule
Emp. Form.:
C34H34Cl3FN2O5
Mol. Mass.:
676.002
SMILES:
COc1ccc2n(C(=O)c3c(Cl)cc(Cl)cc3Cl)c3CCN(CCCOc4cc(F)cc(c4)C4(CCOCC4)OC)Cc3c2c1
: