Target
Histone deacetylase 2
Ligand
BDBM50320735
Substrate
Meas. Tech.
ChEMBL_639020 (CHEMBL1166158)
IC50
10400±n/a nM
Citation
 Lamblin, MDabbas, BSpingarn, RMendoza-Sanchez, RWang, TTAn, BSHuang, DCKremer, RWhite, JHGleason, JL Vitamin D receptor agonist/histone deacetylase inhibitor molecular hybrids. Bioorg Med Chem 18:4119-37 (2010)  
Target
Name:
Histone deacetylase 2
Synonyms:
Cereblon/Histone deacetylase 2 HDAC2 Histone deacetylase 2 (HDAC2) | Human HDAC2
Type:
Chromatin regulator; hydrolase; repressor
Mol. Mass.:
55356.54
Organism:
Homo sapiens (Human)
Description:
Q92769
Residue:
488
  
Inhibitor
Name:
BDBM50320735
Synonyms:
CHEMBL1164992 | triciferol
Type:
Small organic molecule
Emp. Form.:
C26H39NO4
Mol. Mass.:
429.5922
SMILES:
C[C@H](\C=C(/C)\C=C\C(=O)NO)[C@H]1CC[C@H]2\C(CCC[C@]12C)=C\C=C1/C[C@@H](O)C[C@@H](O)C1
: