Target
Histone deacetylase 3
Ligand
BDBM50320735
Substrate
Meas. Tech.
ChEMBL_639021 (CHEMBL1166159)
IC50
13300±n/a nM
Citation
 Lamblin, MDabbas, BSpingarn, RMendoza-Sanchez, RWang, TTAn, BSHuang, DCKremer, RWhite, JHGleason, JL Vitamin D receptor agonist/histone deacetylase inhibitor molecular hybrids. Bioorg Med Chem 18:4119-37 (2010)  
Target
Name:
Histone deacetylase 3
Synonyms:
HD3 HDAC3_HUMAN Human HDAC3 SMAP45
Type:
Enzyme
Mol. Mass.:
48829.55
Organism:
Homo sapiens (Human)
Description:
O15379
Residue:
428
  
Inhibitor
Name:
BDBM50320735
Synonyms:
CHEMBL1164992 | triciferol
Type:
Small organic molecule
Emp. Form.:
C26H39NO4
Mol. Mass.:
429.5922
SMILES:
C[C@H](\C=C(/C)\C=C\C(=O)NO)[C@H]1CC[C@H]2\C(CCC[C@]12C)=C\C=C1/C[C@@H](O)C[C@@H](O)C1
: