Target
Histone deacetylase 3
Ligand
BDBM50320748
Substrate
Meas. Tech.
ChEMBL_639021 (CHEMBL1166159)
IC50
605000±n/a nM
Citation
 Lamblin, MDabbas, BSpingarn, RMendoza-Sanchez, RWang, TTAn, BSHuang, DCKremer, RWhite, JHGleason, JL Vitamin D receptor agonist/histone deacetylase inhibitor molecular hybrids. Bioorg Med Chem 18:4119-37 (2010)  
Target
Name:
Histone deacetylase 3
Synonyms:
HD3 HDAC3_HUMAN Human HDAC3 SMAP45
Type:
Enzyme
Mol. Mass.:
48829.55
Organism:
Homo sapiens (Human)
Description:
O15379
Residue:
428
  
Inhibitor
Name:
BDBM50320748
Synonyms:
CHEMBL1164243 | N-((R)-5-((1R,3aS,7aR,E)-4-(2-((3R,5R)-3,5-Dihydroxycycloheptylidene)ethylidene)-7a-methyloctahydro-1H-inden-1-yl)hexyl)methanesulfamide
Type:
Small organic molecule
Emp. Form.:
C25H44N2O4S
Mol. Mass.:
468.693
SMILES:
[#6]-[#6@H](-[#6]-[#6]-[#6]-[#6]-[#6]-[#7]S([#7])(=O)=O)-[#6@H]1-[#6]-[#6]-[#6@H]2\[#6](-[#6]-[#6]-[#6][C@]12[#6])=[#6]\[#6]=[#6]-1/[#6]-[#6@@H](-[#8])-[#6]-[#6@H](-[#8])-[#6]-1
: