Target
Histone deacetylase 3
Ligand
BDBM50320739
Substrate
Meas. Tech.
ChEMBL_639021 (CHEMBL1166159)
IC50
36000±n/a nM
Citation
 Lamblin, MDabbas, BSpingarn, RMendoza-Sanchez, RWang, TTAn, BSHuang, DCKremer, RWhite, JHGleason, JL Vitamin D receptor agonist/histone deacetylase inhibitor molecular hybrids. Bioorg Med Chem 18:4119-37 (2010)  
Target
Name:
Histone deacetylase 3
Synonyms:
HD3 HDAC3_HUMAN Human HDAC3 SMAP45
Type:
Enzyme
Mol. Mass.:
48829.55
Organism:
Homo sapiens (Human)
Description:
O15379
Residue:
428
  
Inhibitor
Name:
BDBM50320739
Synonyms:
(R)-7-((1R,3aS,7aR,E)-4-(2-((3R,5R)-3,5-Dihydroxycyclohexylidene)ethylidene)-7a-methyl-octahydro-1H-inden-1-yl)-N-methyl-2-oxooctanamide | CHEMBL1164244
Type:
Small organic molecule
Emp. Form.:
C27H43NO4
Mol. Mass.:
445.6346
SMILES:
[#6]-[#7]-[#6](=O)-[#6](=O)-[#6]-[#6]-[#6]-[#6]-[#6@@H](-[#6])-[#6@H]1-[#6]-[#6]-[#6@H]2\[#6](-[#6]-[#6]-[#6][C@]12[#6])=[#6]\[#6]=[#6]-1/[#6]-[#6@@H](-[#8])-[#6]-[#6@H](-[#8])-[#6]-1
: