Target
Histone deacetylase 6
Ligand
BDBM50320740
Substrate
Meas. Tech.
ChEMBL_639022 (CHEMBL1166160)
IC50
9300±n/a nM
Citation
 Lamblin, MDabbas, BSpingarn, RMendoza-Sanchez, RWang, TTAn, BSHuang, DCKremer, RWhite, JHGleason, JL Vitamin D receptor agonist/histone deacetylase inhibitor molecular hybrids. Bioorg Med Chem 18:4119-37 (2010)  
Target
Name:
Histone deacetylase 6
Synonyms:
Cereblon/Histone deacetylase 6 HDAC6 Histone deacetylase 6 (HDAC6) KIAA0901 | ORF Names:JM21
Type:
Chromatin regulator; hydrolase; repressor
Mol. Mass.:
131381.51
Organism:
Homo sapiens (Human)
Description:
Q9UBN7
Residue:
1215
  
Inhibitor
Name:
BDBM50320740
Synonyms:
(R)-5-((1R,3aS,7aR,E)-4-(2-((3R,5R)-3,5-Dihydroxycyclohexylidene)ethylidene)-7a-methyl-octahydro-1-inden-1-yl)-N-hydroxyhexanamide | CHEMBL1165571
Type:
Small organic molecule
Emp. Form.:
C24H39NO4
Mol. Mass.:
405.5708
SMILES:
[#6]-[#6@H](-[#6]-[#6]-[#6]-[#6](=O)-[#7]-[#8])-[#6@H]1-[#6]-[#6]-[#6@H]2\[#6](-[#6]-[#6]-[#6][C@]12[#6])=[#6]\[#6]=[#6]-1/[#6]-[#6@@H](-[#8])-[#6]-[#6@H](-[#8])-[#6]-1
: