Target
Vitamin D3 receptor
Ligand
BDBM50320735
Substrate
Meas. Tech.
ChEMBL_639139 (CHEMBL1167400)
IC50
87±n/a nM
Citation
 Lamblin, MDabbas, BSpingarn, RMendoza-Sanchez, RWang, TTAn, BSHuang, DCKremer, RWhite, JHGleason, JL Vitamin D receptor agonist/histone deacetylase inhibitor molecular hybrids. Bioorg Med Chem 18:4119-37 (2010)  
Target
Name:
Vitamin D3 receptor
Synonyms:
1,25-dihydroxyvitamin D3 receptor Nuclear receptor subfamily 1 group I member 1 VDR | VDR_HUMAN
Type:
Protein
Mol. Mass.:
48288.72
Organism:
Homo sapiens (Human)
Description:
P11473
Residue:
427
  
Inhibitor
Name:
BDBM50320735
Synonyms:
CHEMBL1164992 | triciferol
Type:
Small organic molecule
Emp. Form.:
C26H39NO4
Mol. Mass.:
429.5922
SMILES:
C[C@H](\C=C(/C)\C=C\C(=O)NO)[C@H]1CC[C@H]2\C(CCC[C@]12C)=C\C=C1/C[C@@H](O)C[C@@H](O)C1
: