Target
Vitamin D3 receptor
Ligand
BDBM50320742
Substrate
Meas. Tech.
ChEMBL_639139 (CHEMBL1167400)
IC50
213±n/a nM
Citation
 Lamblin, MDabbas, BSpingarn, RMendoza-Sanchez, RWang, TTAn, BSHuang, DCKremer, RWhite, JHGleason, JL Vitamin D receptor agonist/histone deacetylase inhibitor molecular hybrids. Bioorg Med Chem 18:4119-37 (2010)  
Target
Name:
Vitamin D3 receptor
Synonyms:
1,25-dihydroxyvitamin D3 receptor Nuclear receptor subfamily 1 group I member 1 VDR | VDR_HUMAN
Type:
Protein
Mol. Mass.:
48288.72
Organism:
Homo sapiens (Human)
Description:
P11473
Residue:
427
  
Inhibitor
Name:
BDBM50320742
Synonyms:
CHEMBL1164225 | N-((R)-4-((1R,3aS,7aR,E)-4-(2-((3R,5R)-3,5-Dihydroxycyclohexylidene)ethylidene)-7a-methyl-octahydro-1H-inden-1-yl)pentyl)methanesulfonamide
Type:
Small organic molecule
Emp. Form.:
C24H41NO4S
Mol. Mass.:
439.652
SMILES:
[#6]-[#6@H](-[#6]-[#6]-[#6]-[#7]S([#6])(=O)=O)-[#6@H]1-[#6]-[#6]-[#6@H]2\[#6](-[#6]-[#6]-[#6][C@]12[#6])=[#6]\[#6]=[#6]-1/[#6]-[#6@@H](-[#8])-[#6]-[#6@H](-[#8])-[#6]-1
: