Target
Macrophage colony-stimulating factor 1 receptor
Ligand
BDBM50321363
Substrate
Meas. Tech.
ChEMBL_640283 (CHEMBL1174608)
IC50
1±n/a nM
Citation
 Wilson, KJIllig, CRChen, JWall, MJBallentine, SKDesJarlais, RLChen, YSchubert, CDonatelli, RPetrounia, ICrysler, CSMolloy, CJChaikin, MAManthey, CLPlayer, MRTomczuk, BEMeegalla, SK Reducing ion channel activity in a series of 4-heterocyclic arylamide FMS inhibitors. Bioorg Med Chem Lett 20:3925-9 (2010)  
Target
Name:
Macrophage colony-stimulating factor 1 receptor
Synonyms:
CSF1R FMS Macrophage colony stimulating factor receptor Macrophage colony-stimulating factor 1 receptor (c-FMS) Proto-oncogene c-Fms c-fms | cFMS
Type:
Protein
Mol. Mass.:
107979.48
Organism:
Homo sapiens (Human)
Description:
P07333
Residue:
972
  
Inhibitor
Name:
BDBM50321363
Synonyms:
4-cyano-N-(2-cyclohexenyl-4-(2,6-dioxopiperidin-4-yl)phenyl)-1H-imidazole-2-carboxamide | CHEMBL1171777
Type:
Small organic molecule
Emp. Form.:
C22H21N5O3
Mol. Mass.:
403.4338
SMILES:
O=C(Nc1ccc(cc1C1=CCCCC1)C1CC(=O)NC(=O)C1)c1ncc([nH]1)C#N
: