Target
Macrophage colony-stimulating factor 1 receptor
Ligand
BDBM50321369
Substrate
Meas. Tech.
ChEMBL_640283 (CHEMBL1174608)
IC50
0.9±n/a nM
Citation
 Wilson, KJIllig, CRChen, JWall, MJBallentine, SKDesJarlais, RLChen, YSchubert, CDonatelli, RPetrounia, ICrysler, CSMolloy, CJChaikin, MAManthey, CLPlayer, MRTomczuk, BEMeegalla, SK Reducing ion channel activity in a series of 4-heterocyclic arylamide FMS inhibitors. Bioorg Med Chem Lett 20:3925-9 (2010)  
Target
Name:
Macrophage colony-stimulating factor 1 receptor
Synonyms:
CSF1R FMS Macrophage colony stimulating factor receptor Macrophage colony-stimulating factor 1 receptor (c-FMS) Proto-oncogene c-Fms c-fms | cFMS
Type:
Protein
Mol. Mass.:
107979.48
Organism:
Homo sapiens (Human)
Description:
P07333
Residue:
972
  
Inhibitor
Name:
BDBM50321369
Synonyms:
4-cyano-N-(2-cycloheptenyl-4-(1,3-dimethyl-2-oxohexahydropyrimidin-5-yl)phenyl)-1H-imidazole-2-carboxamide | CHEMBL1171605
Type:
Small organic molecule
Emp. Form.:
C24H28N6O2
Mol. Mass.:
432.5181
SMILES:
CN1CC(CN(C)C1=O)c1ccc(NC(=O)c2ncc([nH]2)C#N)c(c1)C1=CCCCCC1
: