Target
Orexin/Hypocretin receptor type 1
Ligand
BDBM50321516
Substrate
Meas. Tech.
ChEMBL_639601 (CHEMBL1175134)
Ki
0.6±n/a nM
Citation
 Coleman, PJSchreier, JDRoecker, AJMercer, SPMcGaughey, GBCox, CDHartman, GDHarrell, CMReiss, DRDoran, SMGarson, SLAnderson, WBTang, CPrueksaritanont, TWinrow, CJRenger, JJ Discovery of 3,9-diazabicyclo[4.2.1]nonanes as potent dual orexin receptor antagonists with sleep-promoting activity in the rat. Bioorg Med Chem Lett 20:4201-5 (2010)  
Target
Name:
Orexin/Hypocretin receptor type 1
Synonyms:
HCRTR1 OX1R_HUMAN Orexin receptor type 1 (OR 1) Orexin receptor type 1 (OX1) Orexin receptor type 1 (OxR1) | Ox1r
Type:
Protein
Mol. Mass.:
47554.50
Organism:
Homo sapiens (Human)
Description:
O43613
Residue:
425
  
Inhibitor
Name:
BDBM50321516
Synonyms:
((1R,5R)-2-(7-fluoroquinazolin-2-yl)-2,6-diazabicyclo[3.2.2]nonan-6-yl)(5-methyl-2-(2H-1,2,3-triazol-2-yl)phenyl)methanone | CHEMBL1170178
Type:
Small organic molecule
Emp. Form.:
C25H24FN7O
Mol. Mass.:
457.5028
SMILES:
Cc1ccc(c(c1)C(=O)N1C[C@H]2CC[C@@H]1CCN2c1ncc2ccc(F)cc2n1)-n1nccn1
: