Target
Alpha-galactosidase
Ligand
BDBM50321618
Substrate
Meas. Tech.
ChEMBL_639828 (CHEMBL1173843)
Ki
1100±n/a nM
Citation
 Pototschnig, GDe Csáky, CMBurke, JRSchitter, GStütz, AETarling, CAWithers, SGWrodnigg, TM Synthesis and biological evaluation of novel biotin-iminoalditol conjugates. Bioorg Med Chem Lett 20:4077-9 (2010)  
Target
Name:
Alpha-galactosidase
Synonyms:
α-galactosidase Alpha-galactosidase
Type:
Protein
Mol. Mass.:
41306.82
Organism:
Coffea arabica (Coffee beans)
Description:
Residue:
378
  
Inhibitor
Name:
BDBM50321618
Synonyms:
CHEMBL1172470 | N-(N'-Biotinylaminoethyl)-aminocarbonylpentyl-1,5-dideoxy-1,5-imino-D-galactitol
Type:
Small organic molecule
Emp. Form.:
C24H43N5O7S
Mol. Mass.:
545.693
SMILES:
OC[C@@H]1[C@H](O)[C@H](O)[C@@H](O)CN1CCCCCC(=O)NCCNC(=O)CCCCC1SCC2NC(=O)NC12
: