Target
Proto-oncogene tyrosine-protein kinase Src
Ligand
BDBM50321962
Substrate
Meas. Tech.
ChEMBL_642324 (CHEMBL1177350)
IC50
2200±n/a nM
Citation
 Huang, HMa, JShi, JMeng, LJiang, HDing, JLiu, H Discovery of novel purine derivatives with potent and selective inhibitory activity against c-Src tyrosine kinase. Bioorg Med Chem 18:4615-24 (2011)  
Target
Name:
Proto-oncogene tyrosine-protein kinase Src
Synonyms:
Calmodulin/Proto-oncogene tyrosine-protein kinase Src Proto-oncogene c-Src SRC SRC_HUMAN V-src sarcoma (Schmidt-Ruppin A-2) viral oncogene homolog (avian) p60-Src | pp60c-src
Type:
Protein
Mol. Mass.:
59838.60
Organism:
Homo sapiens (Human)
Description:
P12931
Residue:
536
  
Inhibitor
Name:
BDBM50321962
Synonyms:
CHEMBL1173310 | N-(4-Carbamoylphenyl)-2-(piperazin-1-yl)-9H-purin-6-amine
Type:
Small organic molecule
Emp. Form.:
C16H18N8O
Mol. Mass.:
338.3671
SMILES:
NC(=O)c1ccc(Nc2nc(nc3nc[nH]c23)N2CCNCC2)cc1
: