Target
Proto-oncogene tyrosine-protein kinase Src
Ligand
BDBM50321975
Substrate
Meas. Tech.
ChEMBL_642324 (CHEMBL1177350)
IC50
3140±n/a nM
Citation
 Huang, HMa, JShi, JMeng, LJiang, HDing, JLiu, H Discovery of novel purine derivatives with potent and selective inhibitory activity against c-Src tyrosine kinase. Bioorg Med Chem 18:4615-24 (2011)  
Target
Name:
Proto-oncogene tyrosine-protein kinase Src
Synonyms:
Calmodulin/Proto-oncogene tyrosine-protein kinase Src Proto-oncogene c-Src SRC SRC_HUMAN V-src sarcoma (Schmidt-Ruppin A-2) viral oncogene homolog (avian) p60-Src | pp60c-src
Type:
Protein
Mol. Mass.:
59838.60
Organism:
Homo sapiens (Human)
Description:
P12931
Residue:
536
  
Inhibitor
Name:
BDBM50321975
Synonyms:
CHEMBL1173660 | N-Phenyl-2-(4-(2-hydroxyethyl)piperazin-1-yl)-9Hpurin-6-amine
Type:
Small organic molecule
Emp. Form.:
C17H21N7O
Mol. Mass.:
339.3949
SMILES:
OCCN1CCN(CC1)c1nc(Nc2ccccc2)c2[nH]cnc2n1
: