Target
Proto-oncogene tyrosine-protein kinase Src
Ligand
BDBM50321946
Substrate
Meas. Tech.
ChEMBL_642324 (CHEMBL1177350)
IC50
>10000±n/a nM
Citation
 Huang, HMa, JShi, JMeng, LJiang, HDing, JLiu, H Discovery of novel purine derivatives with potent and selective inhibitory activity against c-Src tyrosine kinase. Bioorg Med Chem 18:4615-24 (2011)  
Target
Name:
Proto-oncogene tyrosine-protein kinase Src
Synonyms:
Calmodulin/Proto-oncogene tyrosine-protein kinase Src Proto-oncogene c-Src SRC SRC_HUMAN V-src sarcoma (Schmidt-Ruppin A-2) viral oncogene homolog (avian) p60-Src | pp60c-src
Type:
Protein
Mol. Mass.:
59838.60
Organism:
Homo sapiens (Human)
Description:
P12931
Residue:
536
  
Inhibitor
Name:
BDBM50321946
Synonyms:
(9-Benzyl-9H-purin-6-yl)-phenyl-amine CHEMBL345677
Type:
Small organic molecule
Emp. Form.:
C18H15N5
Mol. Mass.:
301.3452
SMILES:
C(c1ccccc1)n1cnc2c(Nc3ccccc3)ncnc12
: