Target
D(3) dopamine receptor
Ligand
BDBM50322238
Substrate
Meas. Tech.
ChEMBL_642590 (CHEMBL1176479)
Ki
3±n/a nM
Citation
 Vangveravong, STaylor, MXu, JCui, JCalvin, WBabic, SLuedtke, RRMach, RH Synthesis and characterization of selective dopamine D2 receptor antagonists. 2. Azaindole, benzofuran, and benzothiophene analogs of L-741,626. Bioorg Med Chem 18:5291-300 (2010)  
Target
Name:
D(3) dopamine receptor
Synonyms:
DOPAMINE D3 DRD3_HUMAN Dopamine D3 receptor (D3) Dopamine receptor Dopamine receptor D3
Type:
Mol. Mass.:
44243.43
Organism:
Homo sapiens (Human)
Description:
Residue:
400
  
Inhibitor
Name:
BDBM50322238
Synonyms:
1-(1-(Benzofuran-3-ylmethyl)piperidin-4-yl)-1Hbenzo[d]imidazol-2-(3H)-one oxalate | CHEMBL1172214
Type:
Small organic molecule
Emp. Form.:
C21H21N3O2
Mol. Mass.:
347.4103
SMILES:
O=c1[nH]c2ccccc2n1C1CCN(Cc2coc3ccccc23)CC1
: