Target
D(2) dopamine receptor
Ligand
BDBM50322247
Substrate
Meas. Tech.
ChEMBL_642589 (CHEMBL1176478)
Ki
12.5±n/a nM
Citation
 Vangveravong, STaylor, MXu, JCui, JCalvin, WBabic, SLuedtke, RRMach, RH Synthesis and characterization of selective dopamine D2 receptor antagonists. 2. Azaindole, benzofuran, and benzothiophene analogs of L-741,626. Bioorg Med Chem 18:5291-300 (2010)  
Target
Name:
D(2) dopamine receptor
Synonyms:
D(2) dopamine receptor DOPAMINE D2 Long DRD2 Dopamine D2 receptor Dopamine D2 receptor (D2R) Dopamine2-like | d2
Type:
Cell-surface receptors
Mol. Mass.:
50647.10
Organism:
Homo sapiens (Human)
Description:
P14416
Residue:
443
  
Inhibitor
Name:
BDBM50322247
Synonyms:
1-(1-((5-Methoxy-1H-indol-3-yl)methyl)piperidin-4-yl)-1H-benzo[d]imidazol-2(3H)-one oxalate | CHEMBL1173778
Type:
Small organic molecule
Emp. Form.:
C22H24N4O2
Mol. Mass.:
376.4516
SMILES:
COc1ccc2[nH]cc(CN3CCC(CC3)n3c4ccccc4[nH]c3=O)c2c1
: