Target
Beta-secretase 1
Ligand
BDBM50322886
Substrate
Meas. Tech.
ChEMBL_644686 (CHEMBL1211665)
IC50
6±n/a nM
Citation
 Clarke, BCutler, LDemont, EDingwall, CDunsdon, RHawkins, JHowes, CHussain, IMaile, GMatico, RMosley, JNaylor, AO'Brien, ARedshaw, SRowland, PSoleil, VSmith, KJSweitzer, STheobald, PVesey, DWalter, DSWayne, G BACE-1 hydroxyethylamine inhibitors using novel edge-to-face interaction with Arg-296. Bioorg Med Chem Lett 20:4639-44 (2010)  
Target
Name:
Beta-secretase 1
Synonyms:
ASP2 Aspartyl protease 2 BACE1 Beta-secretase (BACE) Beta-secretase 1 (BACE 1) Beta-secretase 1 (BACE1) Beta-site amyloid precursor protein cleaving enzyme 1 Memapsin-2 beta-Secretase (BACE-1) | beta-Secretase (BACE1)
Type:
Protein
Mol. Mass.:
55755.10
Organism:
Homo sapiens (Human)
Description:
P56817
Residue:
501
  
Inhibitor
Name:
BDBM50322886
Synonyms:
CHEMBL1210363 | N-((2S,3R)-3-hydroxy-1-phenyl-4-(3-(trifluoromethyl)benzylamino)butan-2-yl)-3-(2-oxopyrrolidin-1-yl)-5-(N-phenylmethylsulfonamido)benzamide
Type:
Small organic molecule
Emp. Form.:
C36H37F3N4O5S
Mol. Mass.:
694.763
SMILES:
CS(=O)(=O)N(c1ccccc1)c1cc(cc(c1)C(=O)N[C@@H](Cc1ccccc1)[C@H](O)CNCc1cccc(c1)C(F)(F)F)N1CCCC1=O
: