Target
Beta-secretase 2
Ligand
BDBM50322883
Substrate
Meas. Tech.
ChEMBL_644687 (CHEMBL1211666)
IC50
160±n/a nM
Citation
 Clarke, BCutler, LDemont, EDingwall, CDunsdon, RHawkins, JHowes, CHussain, IMaile, GMatico, RMosley, JNaylor, AO'Brien, ARedshaw, SRowland, PSoleil, VSmith, KJSweitzer, STheobald, PVesey, DWalter, DSWayne, G BACE-1 hydroxyethylamine inhibitors using novel edge-to-face interaction with Arg-296. Bioorg Med Chem Lett 20:4639-44 (2010)  
Target
Name:
Beta-secretase 2
Synonyms:
AEPLC ASP1 Asp 1 Aspartyl protease 1 BACE2_HUMAN Beta-secretase (BACE) Beta-secretase 2 (BACE-2) Beta-site APP-cleaving enzyme 2 Memapsin-1 beta-Secretase (BACE-2)
Type:
Protein
Mol. Mass.:
56171.20
Organism:
Homo sapiens (Human)
Description:
Q9Y5Z0
Residue:
518
  
Inhibitor
Name:
BDBM50322883
Synonyms:
3-ethoxy-N-((2S,3R)-3-hydroxy-1-phenyl-4-(3-(trifluoromethyl)benzylamino)butan-2-yl)-5-(N-phenylmethylsulfonamido)benzamide | CHEMBL1210360
Type:
Small organic molecule
Emp. Form.:
C34H36F3N3O5S
Mol. Mass.:
655.727
SMILES:
CCOc1cc(cc(c1)C(=O)N[C@@H](Cc1ccccc1)[C@H](O)CNCc1cccc(c1)C(F)(F)F)N(c1ccccc1)S(C)(=O)=O
: