Target
Cathepsin D
Ligand
BDBM50322885
Substrate
Meas. Tech.
ChEMBL_644688 (CHEMBL1211667)
IC50
250±n/a nM
Citation
 Clarke, BCutler, LDemont, EDingwall, CDunsdon, RHawkins, JHowes, CHussain, IMaile, GMatico, RMosley, JNaylor, AO'Brien, ARedshaw, SRowland, PSoleil, VSmith, KJSweitzer, STheobald, PVesey, DWalter, DSWayne, G BACE-1 hydroxyethylamine inhibitors using novel edge-to-face interaction with Arg-296. Bioorg Med Chem Lett 20:4639-44 (2010)  
Target
Name:
Cathepsin D
Synonyms:
CATD_HUMAN CTSD Cathepsin D heavy chain Cathepsin D precursor
Type:
Enzyme
Mol. Mass.:
44551.72
Organism:
Homo sapiens (Human)
Description:
Human proCathepsin D (SwissProt accession number P07339) was expressed in Sf9 cells, purified, and autoactivated.
Residue:
412
  
Inhibitor
Name:
BDBM50322885
Synonyms:
CHEMBL1210362 | N-((2S,3R)-3-hydroxy-1-phenyl-4-(3-(trifluoromethyl)benzylamino)butan-2-yl)-5-(N-phenylmethylsulfonamido)biphenyl-3-carboxamide
Type:
Small organic molecule
Emp. Form.:
C38H36F3N3O4S
Mol. Mass.:
687.77
SMILES:
CS(=O)(=O)N(c1ccccc1)c1cc(cc(c1)-c1ccccc1)C(=O)N[C@@H](Cc1ccccc1)[C@H](O)CNCc1cccc(c1)C(F)(F)F
: