Target
Sodium-dependent dopamine transporter
Ligand
BDBM50323772
Substrate
Meas. Tech.
ChEMBL_646993 (CHEMBL1217134)
Ki
0.6±n/a nM
Citation
 Stehouwer, JSDaniel, LMChen, PVoll, RJWilliams, LPlott, SJVotaw, JROwens, MJHowell, LGoodman, MM Synthesis, fluorine-18 radiolabeling, and biological evaluation of N-((E)-4-fluorobut-2-en-1-yl)-2beta-carbomethoxy-3beta-(4'-halophenyl)nortropanes: candidate radioligands for in vivo imaging of the brain dopamine transporter with positron emission tomography. J Med Chem 53:5549-57 (2010)  
Target
Name:
Sodium-dependent dopamine transporter
Synonyms:
DA transporter DAT1 Dopamine transporter protein (DAT) SC6A3_HUMAN Sodium-dependent dopamine transporter Solute carrier family 6 member 3
Type:
Multi-pass membrane protein
Mol. Mass.:
68497.11
Organism:
Homo sapiens (Human)
Description:
Q01959
Residue:
620
  
Inhibitor
Name:
BDBM50323772
Synonyms:
CHEMBL1214006 | N-((E)-4-Fluorobut-2-en-1-yl)-2beta-carbomethoxy-3beta-(4'-chlorophenyl)nortropane
Type:
Small organic molecule
Emp. Form.:
C19H23ClFNO2
Mol. Mass.:
351.843
SMILES:
COC(=O)[C@@H]1C2CCC(C[C@@H]1c1ccc(Cl)cc1)N2C\C=C\CF
: