Target
Androgen receptor
Ligand
BDBM50324210
Substrate
Meas. Tech.
ChEMBL_649966 (CHEMBL1219664)
IC50
>8910±n/a nM
Citation
 Meyers, MJArhancet, GBHockerman, SLChen, XLong, SAMahoney, MWRico, JRGarland, DJBlinn, JRCollins, JTYang, SHuang, HCMcGee, KFWendling, JMDietz, JDPayne, MAHomer, BLHeron, MIReitz, DBHu, X Discovery of (3S,3aR)-2-(3-chloro-4-cyanophenyl)-3-cyclopentyl-3,3a,4,5-tetrahydro-2H-benzo[g]indazole-7-carboxylic acid (PF-3882845), an orally efficacious mineralocorticoid receptor (MR) antagonist for hypertension and nephropathy. J Med Chem 53:5979-6002 (2010)  
Target
Name:
Androgen receptor
Synonyms:
ANDR_HUMAN Androgen Receptor Androgen receptor/Baculoviral IAP repeat-containing protein 2 Dihydrotestosterone receptor Nuclear receptor subfamily 3 group C member 4
Type:
Receptor
Mol. Mass.:
99185.27
Organism:
Homo sapiens (Human)
Description:
CHO cells were stably transfected with human AR gene.
Residue:
920
  
Inhibitor
Name:
BDBM50324210
Synonyms:
(+/-)-(3SR,3aRS)-2-(3-Chloro-4-cyanophenyl)-3-cyclopentyl-3,3a,4,5-tetrahydro-2H-benzo[g]indazole-7-carboxylic Acid CHEMBL1215331
Type:
Small organic molecule
Emp. Form.:
C24H22ClN3O2
Mol. Mass.:
419.903
SMILES:
OC(=O)c1ccc2C3=NN([C@@H](C4CCCC4)[C@H]3CCc2c1)c1ccc(C#N)c(Cl)c1
: