Target
Estrogen receptor
Ligand
BDBM50324210
Substrate
Meas. Tech.
ChEMBL_649968 (CHEMBL1219666)
IC50
>10000±n/a nM
Citation
 Meyers, MJArhancet, GBHockerman, SLChen, XLong, SAMahoney, MWRico, JRGarland, DJBlinn, JRCollins, JTYang, SHuang, HCMcGee, KFWendling, JMDietz, JDPayne, MAHomer, BLHeron, MIReitz, DBHu, X Discovery of (3S,3aR)-2-(3-chloro-4-cyanophenyl)-3-cyclopentyl-3,3a,4,5-tetrahydro-2H-benzo[g]indazole-7-carboxylic acid (PF-3882845), an orally efficacious mineralocorticoid receptor (MR) antagonist for hypertension and nephropathy. J Med Chem 53:5979-6002 (2010)  
Target
Name:
Estrogen receptor
Synonyms:
ER ESR ESR1_HUMAN Estrogen receptor Estrogen receptor (ER-alpha) Estrogen receptor alpha (ER) Nuclear receptor subfamily 3 group A member 1
Type:
Protein
Mol. Mass.:
66230.44
Organism:
Homo sapiens (Human)
Description:
P03372
Residue:
595
  
Inhibitor
Name:
BDBM50324210
Synonyms:
(+/-)-(3SR,3aRS)-2-(3-Chloro-4-cyanophenyl)-3-cyclopentyl-3,3a,4,5-tetrahydro-2H-benzo[g]indazole-7-carboxylic Acid CHEMBL1215331
Type:
Small organic molecule
Emp. Form.:
C24H22ClN3O2
Mol. Mass.:
419.903
SMILES:
OC(=O)c1ccc2C3=NN([C@@H](C4CCCC4)[C@H]3CCc2c1)c1ccc(C#N)c(Cl)c1
: