Target
Glucagon-like peptide 1 receptor
Ligand
BDBM50324715
Substrate
Meas. Tech.
ChEMBL_651180 (CHEMBL1227945)
EC50
0.028±n/a nM
Citation
 Day, JWOttaway, NPatterson, JTGelfanov, VSmiley, DGidda, JFindeisen, HBruemmer, DDrucker, DJChaudhary, NHolland, JHembree, JAbplanalp, WGrant, ERuehl, JWilson, HKirchner, HLockie, SHHofmann, SWoods, SCNogueiras, RPfluger, PTPerez-Tilve, DDiMarchi, RTschöp, MH A new glucagon and GLP-1 co-agonist eliminates obesity in rodents. Nat Chem Biol 5:749-57 (2009)  
Target
Name:
Glucagon-like peptide 1 receptor
Synonyms:
GLP-1 receptor GLP-1R GLP1R_HUMAN Glucagon-like peptide 1 receptor (GLP-1)
Type:
Enzyme
Mol. Mass.:
53035.78
Organism:
Homo sapiens (Human)
Description:
P43220
Residue:
463
  
Inhibitor
Name:
BDBM50324715
Synonyms:
CHEMBL1222089
Type:
Small organic molecule
Emp. Form.:
C153H224N40O49S
Mol. Mass.:
3439.719
SMILES:
CSCC[C@H](NC(=O)[C@H](CC(C)C)NC(=O)[C@H](Cc1c[nH]c2ccccc12)NC(=O)[C@H](CCC(N)=O)NC(=O)[C@@H](NC(=O)[C@H](Cc1ccccc1)NC(=O)[C@H](CC(O)=O)NC(=O)[C@H](CCCCN)NC(=O)[C@H](C)NC(=O)[C@H](C)NC(=O)[C@H](CCCN=C(N)N)NC(=O)[C@H](CCC(O)=O)NC(=O)[C@H](CC(O)=O)NC(=O)[C@H](CC(C)C)NC(=O)[C@H](Cc1ccc(O)cc1)NC(=O)[C@H](CCCCN)NC(=O)[C@H](CO)NC(=O)[C@H](Cc1ccc(O)cc1)NC(=O)[C@H](CC(O)=O)NC(=O)[C@H](CO)NC(=O)[C@@H](NC(=O)[C@H](Cc1ccccc1)NC(=O)[C@@H](NC(=O)CNC(=O)[C@H](CCC(N)=O)NC(=O)[C@H](CO)N[C@@H](Cc1cnc[nH]1)C(O)=O)[C@@H](C)O)[C@@H](C)O)C(C)C)C(=O)N[C@@H](CC(N)=O)C(=O)N[C@@H]([C@@H](C)O)C(N)=O
: