Target
Tyrosine-protein kinase ABL1
Ligand
BDBM50303233
Substrate
Meas. Tech.
ChEMBL_652025 (CHEMBL1227835)
Ki
0.02±n/a nM
Citation
 Kraus, GAGupta, VMokhtarian, MMehanovic, SNilsen-Hamilton, M New effective inhibitors of the Abelson kinase. Bioorg Med Chem 18:6316-21 (2010)  
Target
Name:
Tyrosine-protein kinase ABL1
Synonyms:
ABL ABL1_HUMAN JTK7 Proto-oncogene tyrosine-protein kinase ABL1 Tyrosine-protein kinase ABL V-abl Abelson murine leukemia viral oncogene homolog 1 p150 | tyrosine-protein kinase ABL1 isoform a
Type:
Enzyme
Mol. Mass.:
122897.30
Organism:
Homo sapiens (Human)
Description:
P00519
Residue:
1130
  
Inhibitor
Name:
BDBM50303233
Synonyms:
2-(3-aminophenylamino)-6-(2,6-dichlorophenyl)-8-methylpyrido[2,3-d]pyrimidin-7(8H)-one | CHEMBL577269
Type:
Small organic molecule
Emp. Form.:
C20H15Cl2N5O
Mol. Mass.:
412.272
SMILES:
Cn1c2nc(Nc3cccc(N)c3)ncc2cc(-c2c(Cl)cccc2Cl)c1=O
: