Target
RAC-beta serine/threonine-protein kinase
Ligand
BDBM15160
Substrate
Meas. Tech.
ChEMBL_660425 (CHEMBL1250015)
Ki
325±n/a nM
Citation
 Knight, ZAShokat, KM Features of selective kinase inhibitors. Chem Biol 12:621-37 (2005)  
Target
Name:
RAC-beta serine/threonine-protein kinase
Synonyms:
AKT2 PKB beta Protein kinase B (Akt 2) Protein kinase B, beta RAC-alpha serine/threonine-protein kinase (AKT2) RAC-beta serine/threonine-protein kinase (AKT2) Serine/threonine-protein kinase AKT2 | Serine/threonine-protein kinase Rac alpha/beta
Type:
Enzyme
Mol. Mass.:
55766.64
Organism:
Homo sapiens (Human)
Description:
Residue:
481
  
Inhibitor
Name:
BDBM15160
Synonyms:
1-[1-({4-[6-(2-methylpropyl)-5-oxo-3-phenyl-4,5-dihydropyrazin-2-yl]phenyl}methyl)piperidin-4-yl]-2,3-dihydro-1H-1,3-benzodiazol-2-one pyrazinone 13f
Type:
Small organic molecule
Emp. Form.:
C33H35N5O2
Mol. Mass.:
533.6633
SMILES:
CC(C)Cc1nc(-c2ccc(CN3CCC(CC3)n3c4ccccc4[nH]c3=O)cc2)c([nH]c1=O)-c1ccccc1
: