Target
Muscarinic acetylcholine receptor M2
Ligand
BDBM50403547
Substrate
Meas. Tech.
ChEMBL_659455 (CHEMBL1248508)
Ki
1.9±n/a nM
Citation
 Sams, AGHentzer, MMikkelsen, GKLarsen, KBundgaard, CPlath, NChristoffersen, CTBang-Andersen, B Discovery of N-{1-[3-(3-oxo-2,3-dihydrobenzo[1,4]oxazin-4-yl)propyl]piperidin-4-yl}-2-phenylacetamide (Lu AE51090): an allosteric muscarinic M1 receptor agonist with unprecedented selectivity and procognitive potential. J Med Chem 53:6386-97 (2010)  
Target
Name:
Muscarinic acetylcholine receptor M2
Synonyms:
ACM2_HUMAN Cholinergic, muscarinic M2 Muscarinic acetylcholine receptor M2 and M5 | RecName: Full=Muscarinic acetylcholine receptor M2
Type:
GPCR
Mol. Mass.:
51730.61
Organism:
Homo sapiens (Human)
Description:
P08172
Residue:
466
  
Inhibitor
Name:
BDBM50403547
Synonyms:
ATROPEN | ATROPINE
Type:
Small organic molecule
Emp. Form.:
C17H23NO3
Mol. Mass.:
289.3694
SMILES:
CN1[C@H]2CC[C@@H]1C[C@@H](C2)OC(=O)C(CO)c1ccccc1
: