Target
Cyclin-dependent kinase 1
Ligand
BDBM50378552
Substrate
Meas. Tech.
ChEMBL_660572 (CHEMBL1250280)
IC50
6±n/a nM
Citation
 Sridhar, JAkula, NPattabiraman, N Selectivity and potency of cyclin-dependent kinase inhibitors. AAPS J 8:204-21 (2006)  
Target
Name:
Cyclin-dependent kinase 1
Synonyms:
CDC2 CDK1 CDKN1 Cell division protein kinase 1 P34CDC2 | p34 protein kinase
Type:
Enzyme Subunit
Mol. Mass.:
34101.08
Organism:
Homo sapiens (Human)
Description:
P06493
Residue:
297
  
Inhibitor
Name:
BDBM50378552
Synonyms:
CHEMBL291324
Type:
Small organic molecule
Emp. Form.:
C4H5N5O2
Mol. Mass.:
155.1148
SMILES:
Nc1nc(N)c(N=O)c(=O)[nH]1
: