Target
Cyclin-dependent kinase 1
Ligand
BDBM7262
Substrate
Meas. Tech.
ChEMBL_660572 (CHEMBL1250280)
IC50
35±n/a nM
Citation
 Sridhar, JAkula, NPattabiraman, N Selectivity and potency of cyclin-dependent kinase inhibitors. AAPS J 8:204-21 (2006)  
Target
Name:
Cyclin-dependent kinase 1
Synonyms:
CDC2 CDK1 CDKN1 Cell division protein kinase 1 P34CDC2 | p34 protein kinase
Type:
Enzyme Subunit
Mol. Mass.:
34101.08
Organism:
Homo sapiens (Human)
Description:
P06493
Residue:
297
  
Inhibitor
Name:
BDBM7262
Synonyms:
14-nitro-8,18-diazatetracyclo[9.7.0.0^{2,7}.0^{12,17}]octadeca-1(11),2,4,6,12(17),13,15-heptaen-9-one BDBM84528 NSC 705701 alsterpaullone
Type:
Small organic molecule
Emp. Form.:
C16H11N3O3
Mol. Mass.:
293.2768
SMILES:
[O-][N+](=O)c1ccc2[nH]c-3c(CC(=O)Nc4ccccc-34)c2c1
: