Target
Cyclin-dependent kinase 1
Ligand
BDBM5711
Substrate
Meas. Tech.
ChEMBL_660572 (CHEMBL1250280)
IC50
130±n/a nM
Citation
 Sridhar, JAkula, NPattabiraman, N Selectivity and potency of cyclin-dependent kinase inhibitors. AAPS J 8:204-21 (2006)  
Target
Name:
Cyclin-dependent kinase 1
Synonyms:
CDC2 CDK1 CDKN1 Cell division protein kinase 1 P34CDC2 | p34 protein kinase
Type:
Enzyme Subunit
Mol. Mass.:
34101.08
Organism:
Homo sapiens (Human)
Description:
P06493
Residue:
297
  
Inhibitor
Name:
BDBM5711
Synonyms:
(3S,4R)-2-(2-Chlorophenoxy)-5,7-dihydroxy-8-(3-hydroxy-1-methyl-4-piperidinyl)-4H-1-benzopyran-4-one Flavopiridol analogue 18
Type:
Small organic molecule
Emp. Form.:
C21H20ClNO6
Mol. Mass.:
417.84
SMILES:
CN1CC[C@@H]([C@H](O)C1)c1c(O)cc(O)c2c1oc(Oc1ccccc1Cl)cc2=O
: