Target
Cyclin-dependent kinase 2
Ligand
BDBM6939
Substrate
Meas. Tech.
ChEMBL_660573 (CHEMBL1250281)
IC50
9±n/a nM
Citation
 Sridhar, JAkula, NPattabiraman, N Selectivity and potency of cyclin-dependent kinase inhibitors. AAPS J 8:204-21 (2006)  
Target
Name:
Cyclin-dependent kinase 2
Synonyms:
CDK2 CDK2_HUMAN Cell division protein kinase 2 Protein cereblon/Cyclin-dependent kinase 2 | p33 protein kinase
Type:
Enzyme Subunit
Mol. Mass.:
33938.17
Organism:
Homo sapiens (Human)
Description:
P24941
Residue:
298
  
Inhibitor
Name:
BDBM6939
Synonyms:
4-hydroxy-N-({[3-(4-methoxyphenyl)-4-oxo-2H,4H-indeno[1,2-c]pyrazol-5-yl]carbamoyl}amino)benzamide | acylsemicarbazide deriv. 3aa
Type:
Small organic molecule
Emp. Form.:
C25H19N5O5
Mol. Mass.:
469.4489
SMILES:
COc1ccc(cc1)-c1n[nH]c2-c3cccc(NC(=O)NNC(=O)c4ccc(O)cc4)c3C(=O)c12
: