Target
Coagulation factor X
Ligand
BDBM17226
Substrate
Meas. Tech.
ChEMBL_675275 (CHEMBL1273257)
Ki
0.32±n/a nM
Citation
 Pinto, DJSmallheer, JMCheney, DLKnabb, RMWexler, RR Factor Xa inhibitors: next-generation antithrombotic agents. J Med Chem 53:6243-74 (2010)  
Target
Name:
Coagulation factor X
Synonyms:
Activated coagulation factor X (FXa) Coagulation factor X precursor F10 Factor X heavy chain Factor Xa Stuart-Prower factor
Type:
Enzyme
Mol. Mass.:
54726.60
Organism:
Homo sapiens (Human)
Description:
Residue:
488
  
Inhibitor
Name:
BDBM17226
Synonyms:
3-chloro-N-{2-[(4-chlorophenyl)carbamoyl]-4-methylphenyl}-1-benzothiophene-2-carboxamide | benzothiophene compound, 2
Type:
Small organic molecule
Emp. Form.:
C23H16Cl2N2O2S
Mol. Mass.:
455.356
SMILES:
Cc1ccc(NC(=O)c2sc3ccccc3c2Cl)c(c1)C(=O)Nc1ccc(Cl)cc1
: