Target
5-hydroxytryptamine receptor 1A
Ligand
BDBM50330441
Substrate
Meas. Tech.
ChEMBL_684923 (CHEMBL1286338)
IC50
>1.4±n/a nM
Citation
 Asagarasu, AMatsui, THayashi, HTamaoki, SYamauchi, YMinato, KSato, M Discovery of a novel 5-HT(3) antagonist/5-HT(1A) agonist 3-amino-5,6,7,8-tetrahydro-2-{4-[4-(quinolin-2-yl)piperazin-1-yl]butyl}quinazolin-4(3H)-one (TZB-30878) as an orally bioavailable agent for irritable bowel syndrome. J Med Chem 53:7549-63 (2010)  
Target
Name:
5-hydroxytryptamine receptor 1A
Synonyms:
5-HT-1A 5-hydroxytryptamine receptor 1A (5-HT-1A) ADRB2RL1 Dopamine D2 receptor and serotonin 1a receptor HTR1A | Serotonin receptor 1A
Type:
Mol. Mass.:
46122.49
Organism:
Homo sapiens (Human)
Description:
Residue:
422
  
Inhibitor
Name:
BDBM50330441
Synonyms:
3-amino-2-(4-(4-(quinolin-2-yl)piperazin-1-yl)butyl)-5,6,7,8-tetrahydroquinazolin-4(3H)-one | CHEMBL1278088
Type:
Small organic molecule
Emp. Form.:
C25H32N6O
Mol. Mass.:
432.5612
SMILES:
Nn1c(CCCCN2CCN(CC2)c2ccc3ccccc3n2)nc2CCCCc2c1=O
: