Target
Tyrosine-protein kinase JAK1
Ligand
BDBM50332303
Substrate
Meas. Tech.
ChEMBL_686109 (CHEMBL1292865)
IC50
80±n/a nM
Citation
 Malerich, JPLam, JSHart, BFine, RMKlebansky, BTanga, MJD'Andrea, A Diamino-1,2,4-triazole derivatives are selective inhibitors of TYK2 and JAK1 over JAK2 and JAK3. Bioorg Med Chem Lett 20:7454-7 (2010)  
Target
Name:
Tyrosine-protein kinase JAK1
Synonyms:
JAK-1 JAK1A JAK1_HUMAN Janus kinase 1 (JAK1) | Janus kinase 1 JAK1
Type:
Protein
Mol. Mass.:
133293.73
Organism:
Homo sapiens (Human)
Description:
P23458
Residue:
1154
  
Inhibitor
Name:
BDBM50332303
Synonyms:
(5-amino-3-(4-(dimethylamino)phenylamino)-1H-1,2,4-triazol-1-yl)(2,6-difluorophenyl)methanone | CHEMBL1288002
Type:
Small organic molecule
Emp. Form.:
C17H16F2N6O
Mol. Mass.:
358.3453
SMILES:
CN(C)c1ccc(Nc2nc(N)n(n2)C(=O)c2c(F)cccc2F)cc1
: