Target
Tyrosine-protein kinase JAK3
Ligand
BDBM50332299
Substrate
Meas. Tech.
ChEMBL_686111 (CHEMBL1292867)
IC50
>10000±n/a nM
Citation
 Malerich, JPLam, JSHart, BFine, RMKlebansky, BTanga, MJD'Andrea, A Diamino-1,2,4-triazole derivatives are selective inhibitors of TYK2 and JAK1 over JAK2 and JAK3. Bioorg Med Chem Lett 20:7454-7 (2010)  
Target
Name:
Tyrosine-protein kinase JAK3
Synonyms:
JAK-3 JAK3_HUMAN Janus kinase 3 (JAK3) L-JAK | Leukocyte janus kinase
Type:
Protein
Mol. Mass.:
125111.08
Organism:
Homo sapiens (Human)
Description:
P52333
Residue:
1124
  
Inhibitor
Name:
BDBM50332299
Synonyms:
CHEMBL1287940 | methyl 4-(5-amino-1-(2,6-difluorobenzoyl)-1H-1,2,4-triazol-3-ylamino)benzoate
Type:
Small organic molecule
Emp. Form.:
C17H13F2N5O3
Mol. Mass.:
373.3136
SMILES:
COC(=O)c1ccc(Nc2nc(N)n(n2)C(=O)c2c(F)cccc2F)cc1
: