Target
Non-receptor tyrosine-protein kinase TYK2
Ligand
BDBM50332303
Substrate
Meas. Tech.
ChEMBL_686112 (CHEMBL1292868)
IC50
70±n/a nM
Citation
 Malerich, JPLam, JSHart, BFine, RMKlebansky, BTanga, MJD'Andrea, A Diamino-1,2,4-triazole derivatives are selective inhibitors of TYK2 and JAK1 over JAK2 and JAK3. Bioorg Med Chem Lett 20:7454-7 (2010)  
Target
Name:
Non-receptor tyrosine-protein kinase TYK2
Synonyms:
Non-receptor tyrosine-protein kinase TYK2 (TYK2) TYK2_HUMAN | Tyrosine-protein kinase TYK2
Type:
Protein
Mol. Mass.:
133666.03
Organism:
Homo sapiens (Human)
Description:
P29597
Residue:
1187
  
Inhibitor
Name:
BDBM50332303
Synonyms:
(5-amino-3-(4-(dimethylamino)phenylamino)-1H-1,2,4-triazol-1-yl)(2,6-difluorophenyl)methanone | CHEMBL1288002
Type:
Small organic molecule
Emp. Form.:
C17H16F2N6O
Mol. Mass.:
358.3453
SMILES:
CN(C)c1ccc(Nc2nc(N)n(n2)C(=O)c2c(F)cccc2F)cc1
: