Target
Non-receptor tyrosine-protein kinase TYK2
Ligand
BDBM50332309
Substrate
Meas. Tech.
ChEMBL_686112 (CHEMBL1292868)
IC50
>10000±n/a nM
Citation
 Malerich, JPLam, JSHart, BFine, RMKlebansky, BTanga, MJD'Andrea, A Diamino-1,2,4-triazole derivatives are selective inhibitors of TYK2 and JAK1 over JAK2 and JAK3. Bioorg Med Chem Lett 20:7454-7 (2010)  
Target
Name:
Non-receptor tyrosine-protein kinase TYK2
Synonyms:
Non-receptor tyrosine-protein kinase TYK2 (TYK2) TYK2_HUMAN | Tyrosine-protein kinase TYK2
Type:
Protein
Mol. Mass.:
133666.03
Organism:
Homo sapiens (Human)
Description:
P29597
Residue:
1187
  
Inhibitor
Name:
BDBM50332309
Synonyms:
CHEMBL1288063 | ethyl 3-(5-amino-1-(4-(trifluoromethyl)benzoyl)-1H-1,2,4-triazol-3-ylamino)benzoate
Type:
Small organic molecule
Emp. Form.:
C19H16F3N5O3
Mol. Mass.:
419.3572
SMILES:
CCOC(=O)c1cccc(Nc2nc(N)n(n2)C(=O)c2ccc(cc2)C(F)(F)F)c1
: