Target
Carbonic anhydrase 2
Ligand
BDBM26978
Substrate
Meas. Tech.
ChEMBL_700700 (CHEMBL1645739)
Ki
>300000000±n/a nM
Citation
 Ekinci, DCeyhun, SBSentürk, MErdem, DKüfrevioglu, OISupuran, CT Characterization and anions inhibition studies of ana-carbonic anhydrase from the teleost fish Dicentrarchus labrax. Bioorg Med Chem 19:744-8 (2011)  
Target
Name:
Carbonic anhydrase 2
Synonyms:
CA-II CAC Carbonate dehydratase II Carbonic anhydrase 2 (CA-II) Carbonic anhydrase C Carbonic anhydrase II (CA-II) Carbonic anhydrase II (hCA II) | Carbonic anhydrase isoenzyme II (hCA II)
Type:
Enzyme
Mol. Mass.:
29250.71
Organism:
Homo sapiens (Human)
Description:
P00918
Residue:
260
  
Inhibitor
Name:
BDBM26978
Synonyms:
BDBM50098540 CHEMBL1644027 fluoride | fluoride ion
Type:
Ion
Emp. Form.:
F
Mol. Mass.:
18.9989518
SMILES:
[F-]
: