Target
Mu-type opioid receptor
Ligand
BDBM21121
Substrate
Meas. Tech.
ChEMBL_702696 (CHEMBL1657770)
EC50
0.880000±n/a nM
Citation
 Cowell, SMHanlon, KE Development of potent µ and d opioid agonists with high lipophilicity. J Med Chem 54:382-6 (2011)  
Target
Name:
Mu-type opioid receptor
Synonyms:
MOR-1 Mu-type opioid receptor (MOR) OPRM_RAT Opioid receptor B Ror-b
Type:
G Protein-Coupled Receptor (GPCR)
Mol. Mass.:
44503.11
Organism:
Rattus norvegicus (rat)
Description:
Competition binding assays were carried out using membrane preparations from transfected HN9.10 cells that constitutively expressed the mu opioid receptor.
Residue:
398
  
Inhibitor
Name:
BDBM21121
Synonyms:
(2S)-2-amino-3-(4-hydroxy-2,6-dimethylphenyl)-N-[(1R)-1-[({[(2S)-1-oxo-3-phenyl-1-[4-(N-phenylpropanamido)piperidin-1-yl]propan-2-yl]carbamoyl}methyl)carbamoyl]ethyl]propanamide | 4-anilidopiperidine, 16
Type:
Peptide-like ligand
Emp. Form.:
C39H50N6O6
Mol. Mass.:
698.8509
SMILES:
CCC(=O)N(C1CCN(CC1)C(=O)[C@H](Cc1ccccc1)NC(=O)CNC(=O)[C@@H](C)NC(=O)[C@@H](N)Cc1c(C)cc(O)cc1C)c1ccccc1
: