Target
Delta-type opioid receptor
Ligand
BDBM21123
Substrate
Meas. Tech.
ChEMBL_702692 (CHEMBL1657628)
IC50
724±n/a nM
Citation
 Cowell, SMHanlon, KE Development of potent µ and d opioid agonists with high lipophilicity. J Med Chem 54:382-6 (2011)  
Target
Name:
Delta-type opioid receptor
Synonyms:
D-OR-1 Delta opioid receptor OPIATE Delta OPRD1 OPRK1 | opioid receptor, delta 1
Type:
G Protein-Coupled Receptor (GPCR)
Mol. Mass.:
40382.98
Organism:
Homo sapiens (Human)
Description:
Competition binding assays were carried out using membrane preparations from transfected HN9.10 cells that constitutively expressed the delta opioid receptor.
Residue:
372
  
Inhibitor
Name:
BDBM21123
Synonyms:
(2S)-2-{2-[(2R)-2-[(2S)-2-amino-3-(4-hydroxyphenyl)propanamido]propanamido]acetamido}-3-phenylpropanamide YDAGF-NH2
Type:
Peptide
Emp. Form.:
C23H29N5O5
Mol. Mass.:
455.5069
SMILES:
C[C@@H](NC(=O)[C@@H](N)Cc1ccc(O)cc1)C(=O)NCC(=O)N[C@@H](Cc1ccccc1)C(N)=O
: