Target
Delta-type opioid receptor
Ligand
BDBM50334992
Substrate
Meas. Tech.
ChEMBL_702698 (CHEMBL1657772)
IC50
8.5±n/a nM
Citation
 Cowell, SMHanlon, KE Development of potent µ and d opioid agonists with high lipophilicity. J Med Chem 54:382-6 (2011)  
Target
Name:
Delta-type opioid receptor
Synonyms:
DOR-1 MSL-2 OPRD_MOUSE Oprd1
Type:
Enzyme Catalytic Domain
Mol. Mass.:
40577.25
Organism:
MOUSE
Description:
P32300
Residue:
372
  
Inhibitor
Name:
BDBM50334992
Synonyms:
(R)-2-((S)-2-amino-3-(4-hydroxy-2,6-dimethylphenyl)propanamido)-N-((S)-1-oxo-3-phenyl-1-(4-(N-phenylpropionamido)piperidin-1-yl)propan-2-yl)hexanamide | CHEMBL1649939
Type:
Small organic molecule
Emp. Form.:
C40H53N5O5
Mol. Mass.:
683.8793
SMILES:
CCCC[C@@H](NC(=O)[C@@H](N)Cc1c(C)cc(O)cc1C)C(=O)N[C@@H](Cc1ccccc1)C(=O)N1CCC(CC1)N(C(=O)CC)c1ccccc1
: