Target
Transient receptor potential cation channel subfamily M member 8
Ligand
BDBM50335157
Substrate
Meas. Tech.
ChEMBL_702910 (CHEMBL1655535)
IC50
0.413±n/a nM
Citation
 Ballentine, SKColburn, RWDamiano, BPFlores, CMHutchinson, TLIllig, CRLiu, YLubin, MLMa, JMeegalla, SKParks, DJBaker, JFParsons, WHPlayer, MRQin, NSchneider, CRStone, DJ Design and optimization of benzimidazole-containing transient receptor potential melastatin 8 (TRPM8) antagonists. J Med Chem 54:233-47 (2011)  
Target
Name:
Transient receptor potential cation channel subfamily M member 8
Synonyms:
LTRPC6 TRPM8_HUMAN Transient receptor potential M8 protein (TRPM8) Transient receptor potential cation channel subfamily M member 8 (TRPM8)
Type:
Enzyme
Mol. Mass.:
127693.26
Organism:
Homo sapiens (Human)
Description:
Q7Z2W7
Residue:
1104
  
Inhibitor
Name:
BDBM50335157
Synonyms:
3-[7-Trifluoromethyl-5-(2-trifluoromethyl-phenyl)-1H-benzimidazol-2-yl]-1-oxa-2-aza-spiro[4.5]dec-2-ene | CHEMBL1650511
Type:
Small organic molecule
Emp. Form.:
C23H19F6N3O
Mol. Mass.:
467.4069
SMILES:
FC(F)(F)c1ccccc1-c1cc(c2[nH]c(nc2c1)C1=NOC2(C1)CCCCC2)C(F)(F)F
: