Target
Cathepsin K
Ligand
BDBM50335278
Substrate
Meas. Tech.
ChEMBL_702784 (CHEMBL1655227)
Ki
0.071±n/a nM
Citation
 Frizler, MLohr, FFurtmann, NKläs, JGütschow, M Structural optimization of azadipeptide nitriles strongly increases association rates and allows the development of selective cathepsin inhibitors. J Med Chem 54:396-400 (2011)  
Target
Name:
Cathepsin K
Synonyms:
CATK_HUMAN CTSO Cathepsin O Cathepsin X
Type:
Enzyme
Mol. Mass.:
36975.68
Organism:
Homo sapiens (Human)
Description:
P43235
Residue:
329
  
Inhibitor
Name:
BDBM50335278
Synonyms:
CHEMBL1651352 | N-(Benzyloxycarbonyl)-cyclohexylalanyl-methylazalanine-nitrile
Type:
Small organic molecule
Emp. Form.:
C20H28N4O3
Mol. Mass.:
372.4613
SMILES:
CN(C#N)N(C)C(=O)[C@H](CC1CCCCC1)NC(=O)OCc1ccccc1
: