Target
Cathepsin K
Ligand
BDBM50335283
Substrate
Meas. Tech.
ChEMBL_702784 (CHEMBL1655227)
Ki
0.072±n/a nM
Citation
 Frizler, MLohr, FFurtmann, NKläs, JGütschow, M Structural optimization of azadipeptide nitriles strongly increases association rates and allows the development of selective cathepsin inhibitors. J Med Chem 54:396-400 (2011)  
Target
Name:
Cathepsin K
Synonyms:
CATK_HUMAN CTSO Cathepsin O Cathepsin X
Type:
Enzyme
Mol. Mass.:
36975.68
Organism:
Homo sapiens (Human)
Description:
P43235
Residue:
329
  
Inhibitor
Name:
BDBM50335283
Synonyms:
CHEMBL1651357 acs.jmedchem.1c00409_ST.406
Type:
Small organic molecule
Emp. Form.:
C23H27N7O3S
Mol. Mass.:
481.571
SMILES:
CC(C)C[C@H](NC(=O)NCc1ccc(cc1)-c1noc(n1)-c1cccs1)C(=O)N(C)N(C)C#N
: