Target
Albumin
Ligand
BDBM50045004
Substrate
Meas. Tech.
ChEMBL_705623 (CHEMBL1661507)
Kd
12000±n/a nM
Citation
 Banères-Roquet, FGualtieri, MVillain-Guillot, PPugnière, MLeonetti, JP Use of a surface plasmon resonance method to investigate antibiotic and plasma protein interactions. Antimicrob Agents Chemother 53:1528-31 (2009)  
Target
Name:
Albumin
Synonyms:
ALB Serum albumin
Type:
PROTEIN
Mol. Mass.:
69362.94
Organism:
Homo sapiens (Human)
Description:
ChEMBL_1509401
Residue:
609
  
Inhibitor
Name:
BDBM50045004
Synonyms:
9-fluoro-3-methyl-10-(4-methylpiperazin-1-yl)-7-oxo-2,3-dihydro-7H-[1,4]oxazino[2,3,4-ij]quinoline-6-carboxylic acid OFLOXACIN | OFLX
Type:
Small organic molecule
Emp. Form.:
C18H20FN3O4
Mol. Mass.:
361.3675
SMILES:
CC1COc2c(N3CCN(C)CC3)c(F)cc3c2n1cc(C(O)=O)c3=O
: