Target
P2X purinoceptor 4
Ligand
BDBM50268876
Substrate
Meas. Tech.
ChEMBL_718658 (CHEMBL1680809)
IC50
>10000±n/a nM
Citation
 Baqi, YHausmann, RRosefort, CRettinger, JSchmalzing, GMüller, CE Discovery of potent competitive antagonists and positive modulators of the P2X2 receptor. J Med Chem 54:817-30 (2012)  
Target
Name:
P2X purinoceptor 4
Synonyms:
P2RX4_RAT Purinergic, P2X4
Type:
Enzyme Catalytic Domain
Mol. Mass.:
43504.16
Organism:
RAT
Description:
Purinergic, P2X4 0 RAT::P51577
Residue:
388
  
Inhibitor
Name:
BDBM50268876
Synonyms:
CHEMBL509572 | Disodium 1-amino-4-[4-(4-chloro-6-methoxy-[1,3,5]triazine-2-ylamino)-3-sulfophenylamino]-9,10-dioxo-9,10-dihydroanthracene-2-sulfonate
Type:
Small organic molecule
Emp. Form.:
C24H15ClN6O9S2
Mol. Mass.:
630.995
SMILES:
COc1nc(Cl)nc(Nc2ccc(Nc3cc(c(N)c4C(=O)c5ccccc5C(=O)c34)S([O-])(=O)=O)cc2S([O-])(=O)=O)n1
: