Target
P2Y purinoceptor 12
Ligand
BDBM50336781
Substrate
Meas. Tech.
ChEMBL_718672 (CHEMBL1680823)
Ki
17100±n/a nM
Citation
 Baqi, YHausmann, RRosefort, CRettinger, JSchmalzing, GMüller, CE Discovery of potent competitive antagonists and positive modulators of the P2X2 receptor. J Med Chem 54:817-30 (2012)  
Target
Name:
P2Y purinoceptor 12
Synonyms:
ADP-glucose receptor HORK3 P2T(AC) P2Y(AC) P2Y(cyc) P2Y12 platelet ADP receptor Purinergic receptor P2Y12 | SP1999
Type:
Enzyme
Mol. Mass.:
39458.48
Organism:
Homo sapiens (Human)
Description:
Q9H244
Residue:
342
  
Inhibitor
Name:
BDBM50336781
Synonyms:
CHEMBL1672104 | Disodium 1-Amino-4-[3-(4,6-dichloro[1,3,5]triazine-2-ylamino)-4-sulfophenylamino]-9,10-dioxo-9,10-dihydroanthracene-2-sulfonate
Type:
Small organic molecule
Emp. Form.:
C23H12Cl2N6O8S2
Mol. Mass.:
635.414
SMILES:
Nc1c(cc(Nc2ccc(c(Nc3nc(Cl)nc(Cl)n3)c2)S([O-])(=O)=O)c2C(=O)c3ccccc3C(=O)c12)S([O-])(=O)=O
: